Reaction Details
TargetRho-associated protein kinase 1
LigandBDBM50097162
Substrate/Competitorn/a
Meas. Tech.ChEMBL_1499748 (CHEMBL3585197)
Ki>2500±n/a nM
Citation Green, JCao, JBandarage, UKGao, HCourt, JMarhefka, CJacobs, MTaslimi, PNewsome, DNakayama, TShah, SRodems, S Design, Synthesis, and Structure-Activity Relationships of Pyridine-Based Rho Kinase (ROCK) Inhibitors. J Med Chem58:5028-37 (2015) 
 
Rho-associated protein kinase 1
Name:Rho-associated protein kinase 1
Type:Serine/threonine-protein kinase
Mol. Mass.:158156.77
Organism:Homo sapiens (Human)
Description:Q13464
Residue:1354
BDBM50097162
NameBDBM50097162
Synonyms:CHEMBL3581143
TypeSmall organic molecule
Emp. Form.C18H17N3O3S
Mol. Mass.355.411
SMILESCOc1cccc(CC(=O)Nc2nc(cs2)-c2ccnc(OC)c2)c1