Reaction Details
TargetTyrosine-protein kinase BTK
LigandBDBM50097397
Substrate/Competitorn/a
Meas. Tech.ChEMBL_1501913 (CHEMBL3588253)
IC50 240000±n/a nM
Citation Smith, CRDougan, DRKomandla, MKanouni, TKnight, BLawson, JDSabat, MTaylor, ERVu, PWyrick, C Fragment-Based Discovery of a Small Molecule Inhibitor of Bruton's Tyrosine Kinase. J Med Chem58:5437-44 (2015) 
 
Tyrosine-protein kinase BTK
Name:Tyrosine-protein kinase BTK
Type:Enzyme
Mol. Mass.:76289.95
Organism:Homo sapiens (Human)
Description:Q06187
Residue:659
BDBM50097397
NameBDBM50097397
Synonyms:CHEMBL3586443
TypeSmall organic molecule
Emp. Form.C13H12N6O
Mol. Mass.268.274
SMILESCn1cc(cn1)-c1cccc2c(N)c(nnc12)C(N)=O