Reaction Details
TargetTyrosine-protein kinase BTK
LigandBDBM50097398
Substrate/Competitorn/a
Meas. Tech.ChEMBL_1501913 (CHEMBL3588253)
IC50 3500±n/a nM
Citation Smith, CRDougan, DRKomandla, MKanouni, TKnight, BLawson, JDSabat, MTaylor, ERVu, PWyrick, C Fragment-Based Discovery of a Small Molecule Inhibitor of Bruton's Tyrosine Kinase. J Med Chem58:5437-44 (2015) 
 
Tyrosine-protein kinase BTK
Name:Tyrosine-protein kinase BTK
Type:Enzyme
Mol. Mass.:76289.95
Organism:Homo sapiens (Human)
Description:Q06187
Residue:659
BDBM50097398
NameBDBM50097398
Synonyms:CHEMBL449216 | HTS-9026
TypeSmall organic molecule
Emp. Form.C9H8N4O
Mol. Mass.188.186
SMILESNC(=O)c1nnc2ccccc2c1N