Reaction Details
TargetActivated CDC42 kinase 1
LigandBDBM50097393
Substrate/Competitorn/a
Meas. Tech.ChEMBL_1501910 (CHEMBL3588250)
IC50 11±n/a nM
Citation Smith, CRDougan, DRKomandla, MKanouni, TKnight, BLawson, JDSabat, MTaylor, ERVu, PWyrick, C Fragment-Based Discovery of a Small Molecule Inhibitor of Bruton's Tyrosine Kinase. J Med Chem58:5437-44 (2015) 
 
Activated CDC42 kinase 1
Name:Activated CDC42 kinase 1
Type:Protein
Mol. Mass.:114577.86
Organism:Homo sapiens (Human)
Description:Q07912
Residue:1038
BDBM50097393
NameBDBM50097393
Synonyms:CHEMBL3586447
TypeSmall organic molecule
Emp. Form.C17H14N6O
Mol. Mass.318.3327
SMILESCc1cc2cn[nH]c2cc1-c1cccc2c(N)c(nnc12)C(N)=O