Reaction Details
TargetTyrosine-protein kinase BTK
LigandBDBM50097393
Substrate/Competitorn/a
Meas. Tech.ChEMBL_1501937 (CHEMBL3588277)
IC50 2.0±n/a nM
Citation Smith, CRDougan, DRKomandla, MKanouni, TKnight, BLawson, JDSabat, MTaylor, ERVu, PWyrick, C Fragment-Based Discovery of a Small Molecule Inhibitor of Bruton's Tyrosine Kinase. J Med Chem58:5437-44 (2015) 
 
Tyrosine-protein kinase BTK
Name:Tyrosine-protein kinase BTK
Type:Enzyme
Mol. Mass.:76289.95
Organism:Homo sapiens (Human)
Description:Q06187
Residue:659
BDBM50097393
NameBDBM50097393
Synonyms:CHEMBL3586447
TypeSmall organic molecule
Emp. Form.C17H14N6O
Mol. Mass.318.3327
SMILESCc1cc2cn[nH]c2cc1-c1cccc2c(N)c(nnc12)C(N)=O