Reaction Details
TargetAurora kinase B
LigandBDBM50097413
Substrate/Competitorn/a
Meas. Tech.ChEMBL_1502091 (CHEMBL3586966)
IC50 2500±n/a nM
Citation Sells, TBChau, REcsedy, JAGershman, REHoar, KHuck, JJanowick, DAKadambi, VJLeRoy, PJStirling, MStroud, SGVos, TJWeatherhead, GSWysong, DRZhang, MBalani, SKBolen, JBManfredi, MGClaiborne, CF MLN8054 and Alisertib (MLN8237): Discovery of Selective Oral Aurora A Inhibitors. ACS Med Chem Lett6:630-4 (2015) 
 
Aurora kinase B
Name:Aurora kinase B
Type:Protein
Mol. Mass.:39327.72
Organism:Homo sapiens (Human)
Description:Q96GD4
Residue:344
BDBM50097413
NameBDBM50097413
Synonyms:CHEMBL3586473
TypeSmall organic molecule
Emp. Form.C26H18ClFN4O3
Mol. Mass.488.898
SMILESCOc1cccc(F)c1C1=NCc2cnc(Nc3ccc(cc3)C(O)=O)nc2-c2ccc(Cl)cc12