Reaction Details
TargetAurora kinase A
LigandBDBM50097413
Substrate/Competitorn/a
Meas. Tech.ChEMBL_1502090 (CHEMBL3586965)
IC50 18±n/a nM
Citation Sells, TBChau, REcsedy, JAGershman, REHoar, KHuck, JJanowick, DAKadambi, VJLeRoy, PJStirling, MStroud, SGVos, TJWeatherhead, GSWysong, DRZhang, MBalani, SKBolen, JBManfredi, MGClaiborne, CF MLN8054 and Alisertib (MLN8237): Discovery of Selective Oral Aurora A Inhibitors. ACS Med Chem Lett6:630-4 (2015) 
 
Aurora kinase A
Name:Aurora kinase A
Type:Serine/threonine-protein kinase
Mol. Mass.:45830.98
Organism:Homo sapiens (Human)
Description:O14965
Residue:403
BDBM50097413
NameBDBM50097413
Synonyms:CHEMBL3586473
TypeSmall organic molecule
Emp. Form.C26H18ClFN4O3
Mol. Mass.488.898
SMILESCOc1cccc(F)c1C1=NCc2cnc(Nc3ccc(cc3)C(O)=O)nc2-c2ccc(Cl)cc12