Reaction Details
TargetSarcoplasmic/endoplasmic reticulum calcium ATPase 2
LigandBDBM50409816
Substrate/Competitorn/a
Meas. Tech.ChEMBL_1500496 (CHEMBL3587396)
IC50 6720±n/a nM
Citation De Ford, CCalderón, CSehgal, PFedosova, NUMurillo, ROlesen, CNissen, PMĝller, JVMerfort, I Discovery of Tricyclic Clerodane Diterpenes as Sarco/Endoplasmic Reticulum Ca(2+)-ATPase Inhibitors and Structure-Activity Relationships. J Nat Prod78:1262-70 (2015) 
 
Sarcoplasmic/endoplasmic reticulum calcium ATPase 2
Name:Sarcoplasmic/endoplasmic reticulum calcium ATPase 2
Type:PROTEIN
Mol. Mass.:114748.59
Organism:Rattus norvegicus
Description:ChEMBL_109815
Residue:1043
BDBM50409816
NameBDBM50409816
Synonyms:ABAMECTIN
TypeSmall organic molecule
Emp. Form.C48H74O14
Mol. Mass.875.0928
SMILESCC[C@H](C)[C@H]1O[C@]2(CC[C@@H]1C)C[C@@H]1C[C@@H](C\C=C(C)\[C@@H](O[C@H]3C[C@H](OC)[C@@H](O[C@H]4C[C@H](OC)[C@@H](O)[C@H](C)O4)[C@H](C)O3)[C@@H](C)\C=C\C=C3/CO[C@@H]4[C@H](O)C(C)=C[C@@H](C(=O)O1)[C@]34O)O2