Reaction Details
TargetSarcoplasmic/endoplasmic reticulum calcium ATPase 1
LigandBDBM50097547
Substrate/Competitorn/a
Meas. Tech.ChEMBL_1500494 (CHEMBL3587394)
Kd 7500±n/a nM
Citation De Ford, CCalderón, CSehgal, PFedosova, NUMurillo, ROlesen, CNissen, PMĝller, JVMerfort, I Discovery of Tricyclic Clerodane Diterpenes as Sarco/Endoplasmic Reticulum Ca(2+)-ATPase Inhibitors and Structure-Activity Relationships. J Nat Prod78:1262-70 (2015) 
 
Sarcoplasmic/endoplasmic reticulum calcium ATPase 1
Name:Sarcoplasmic/endoplasmic reticulum calcium ATPase 1
Type:PROTEIN
Mol. Mass.:110435.34
Organism:Oryctolagus cuniculus
Description:ChEMBL_1500621
Residue:1001
BDBM50097547
NameBDBM50097547
Synonyms:CHEMBL3125413
TypeSmall organic molecule
Emp. Form.C36H56O9
Mol. Mass.632.8244
SMILES[H][C@@]12C[C@@H](O)C=C3[C@@H](OC(C)=O)O[C@@H](OC(C)=O)[C@@]13[C@H](C[C@@H](C)[C@@]2(C)CCC(=C)C=C)OC(=O)CC(O)CCCCCCCCC