Reaction Details
TargetSarcoplasmic/endoplasmic reticulum calcium ATPase 1
LigandBDBM50097557
Substrate/Competitorn/a
Meas. Tech.ChEMBL_1500621 (CHEMBL3587751)
Kd 50000±n/a nM
Citation De Ford, CCalderón, CSehgal, PFedosova, NUMurillo, ROlesen, CNissen, PMĝller, JVMerfort, I Discovery of Tricyclic Clerodane Diterpenes as Sarco/Endoplasmic Reticulum Ca(2+)-ATPase Inhibitors and Structure-Activity Relationships. J Nat Prod78:1262-70 (2015) 
 
Sarcoplasmic/endoplasmic reticulum calcium ATPase 1
Name:Sarcoplasmic/endoplasmic reticulum calcium ATPase 1
Type:PROTEIN
Mol. Mass.:110435.34
Organism:Oryctolagus cuniculus
Description:ChEMBL_1500621
Residue:1001
BDBM50097557
NameBDBM50097557
Synonyms:CHEMBL3586100
TypeSmall organic molecule
Emp. Form.C42H68O13
Mol. Mass.780.9815
SMILES[H][C@@]12CC(C)(C)CC[C@@]11CO[C@@]22C=C[C@]3([H])[C@@]4(C)CC[C@H](O[C@@H]5O[C@H](C)[C@@H](O)[C@H](O[C@@H]6O[C@H](CO)[C@@H](O)[C@H](O)[C@H]6O)[C@H]5O)[C@@](C)(CO)[C@]4([H])CC[C@@]3(C)[C@]2(C)C[C@H]1O