Reaction Details
TargetHeat shock protein beta-1
LigandBDBM50097558
Substrate/Competitorn/a
Meas. Tech.ChEMBL_1500622 (CHEMBL3587752)
IC50 200±n/a nM
Citation Fossa, PCichero, E In silico evaluation of human small heat shock protein HSP27: homology modeling, mutation analyses and docking studies. Bioorg Med Chem23:3215-20 (2015) 
 
Heat shock protein beta-1
Name:Heat shock protein beta-1
Type:PROTEIN
Mol. Mass.:22781.73
Organism:Homo sapiens (Human)
Description:ChEMBL_1500622
Residue:205
BDBM50097558
NameBDBM50097558
Synonyms:CHEMBL1935538 | NSC-751382
TypeSmall organic molecule
Emp. Form.C25H26N2O6S
Mol. Mass.482.549
SMILESCN(c1ccc(NC(=O)c2ccc3OCOc3c2)cc1OCc1cc(C)ccc1C)S(C)(=O)=O