Reaction Details
Target5-hydroxytryptamine receptor 2C
LigandBDBM50097674
Substrate/Competitorn/a
Meas. Tech.ChEMBL_1504493 (CHEMBL3590935)
Ki 2.5±n/a nM
Citation Hansen, MJacobsen, SEPlunkett, SLiebscher, GEMcCorvy, JDBräuner-Osborne, HKristensen, JL Synthesis and pharmacological evaluation of N-benzyl substituted 4-bromo-2,5-dimethoxyphenethylamines as 5-HT2A/2C partial agonists. Bioorg Med Chem23:3933-7 (2015) 
 
5-hydroxytryptamine receptor 2C
Name:5-hydroxytryptamine receptor 2C
Type:G Protein-Coupled Receptor (GPCR)
Mol. Mass.:51836.79
Organism:Homo sapiens (Human)
Description:P28335
Residue:458
BDBM50097674
NameBDBM50097674
Synonyms:CHEMBL3589579
TypeSmall organic molecule
Emp. Form.C19H20BrNO3
Mol. Mass.390.271
SMILESCOc1cc(CCNCc2cccc3ccoc23)c(OC)cc1Br