Reaction Details
Target5-hydroxytryptamine receptor 2A
LigandBDBM50097693
Substrate/Competitorn/a
Meas. Tech.ChEMBL_1504492 (CHEMBL3590934)
Ki 1.3±n/a nM
Citation Hansen, MJacobsen, SEPlunkett, SLiebscher, GEMcCorvy, JDBräuner-Osborne, HKristensen, JL Synthesis and pharmacological evaluation of N-benzyl substituted 4-bromo-2,5-dimethoxyphenethylamines as 5-HT2A/2C partial agonists. Bioorg Med Chem23:3933-7 (2015) 
 
5-hydroxytryptamine receptor 2A
Name:5-hydroxytryptamine receptor 2A
Type:undefined
Mol. Mass.:52607.65
Organism:Homo sapiens (Human)
Description:P28223
Residue:471
BDBM50097693
NameBDBM50097693
Synonyms:CHEMBL3589598
TypeSmall organic molecule
Emp. Form.C17H20BrNO3
Mol. Mass.366.25
SMILESCOc1cc(CCNCc2cccc(O)c2)c(OC)cc1Br