Reaction Details
Target5-hydroxytryptamine receptor 2A
LigandBDBM50097678
Substrate/Competitorn/a
Meas. Tech.ChEMBL_1504492 (CHEMBL3590934)
Ki 7.8±n/a nM
Citation Hansen, MJacobsen, SEPlunkett, SLiebscher, GEMcCorvy, JDBräuner-Osborne, HKristensen, JL Synthesis and pharmacological evaluation of N-benzyl substituted 4-bromo-2,5-dimethoxyphenethylamines as 5-HT2A/2C partial agonists. Bioorg Med Chem23:3933-7 (2015) 
 
5-hydroxytryptamine receptor 2A
Name:5-hydroxytryptamine receptor 2A
Type:undefined
Mol. Mass.:52607.65
Organism:Homo sapiens (Human)
Description:P28223
Residue:471
BDBM50097678
NameBDBM50097678
Synonyms:CHEMBL3589583
TypeSmall organic molecule
Emp. Form.C18H20BrN3O2
Mol. Mass.390.274
SMILESCOc1cc(CCNCc2cccc3nc[nH]c23)c(OC)cc1Br