Reaction Details
TargetKappa-type opioid receptor
LigandBDBM71581
Substrate/Competitorn/a
Meas. Tech.ChEMBL_1504508 (CHEMBL3590950)
IC50 660±n/a nM
Citation Frankowski, KJSlauson, SRLovell, KMPhillips, AMStreicher, JMZhou, LWhipple, DASchoenen, FJPrisinzano, TEBohn, LMAubé, J Potency enhancement of the¿-opioid receptor antagonist probe ML140 through sulfonamide constraint utilizing a tetrahydroisoquinoline motif. Bioorg Med Chem23:3948-56 (2015) 
 
Kappa-type opioid receptor
Name:Kappa-type opioid receptor
Type:G Protein-Coupled Receptor (GPCR)
Mol. Mass.:42648.76
Organism:Homo sapiens (Human)
Description:P41145
Residue:380
BDBM71581
NameBDBM71581
Synonyms:KSC-5-280C N-[2-[(4-bromobenzyl)-isopropyl-amino]ethyl]-4-[(tosylamino)methyl]benzamide N-[2-[(4-bromophenyl)methyl-propan-2-ylamino]ethyl]-4-[[(4-methylphenyl)sulfonylamino]methyl]benzamide | cid_44620907
TypeSmall organic molecule
Emp. Form.C27H32BrN3O3S
Mol. Mass.558.53
SMILESCC(C)N(CCNC(=O)c1ccc(CNS(=O)(=O)c2ccc(C)cc2)cc1)Cc1ccc(Br)cc1