Reaction Details
TargetKappa-type opioid receptor
LigandBDBM50097704
Substrate/Competitorn/a
Meas. Tech.ChEMBL_1504511 (CHEMBL3590953)
IC50 2.9±n/a nM
Citation Frankowski, KJSlauson, SRLovell, KMPhillips, AMStreicher, JMZhou, LWhipple, DASchoenen, FJPrisinzano, TEBohn, LMAubé, J Potency enhancement of the¿-opioid receptor antagonist probe ML140 through sulfonamide constraint utilizing a tetrahydroisoquinoline motif. Bioorg Med Chem23:3948-56 (2015) 
 
Kappa-type opioid receptor
Name:Kappa-type opioid receptor
Type:G Protein-Coupled Receptor (GPCR)
Mol. Mass.:42648.76
Organism:Homo sapiens (Human)
Description:P41145
Residue:380
BDBM50097704
NameBDBM50097704
Synonyms:CHEMBL3590200
TypeSmall organic molecule
Emp. Form.C30H36BrN3O3S
Mol. Mass.598.594
SMILESCc1ccc(cc1)S(=O)(=O)N1CCc2cc(ccc2C1)C(=O)NCCN(Cc1ccc(Br)cc1)C(C)(C)C