Reaction Details
TargetKappa-type opioid receptor
LigandBDBM50097695
Substrate/Competitorn/a
Meas. Tech.ChEMBL_1504512 (CHEMBL3590954)
IC50 406±n/a nM
Citation Frankowski, KJSlauson, SRLovell, KMPhillips, AMStreicher, JMZhou, LWhipple, DASchoenen, FJPrisinzano, TEBohn, LMAubé, J Potency enhancement of the¿-opioid receptor antagonist probe ML140 through sulfonamide constraint utilizing a tetrahydroisoquinoline motif. Bioorg Med Chem23:3948-56 (2015) 
 
Kappa-type opioid receptor
Name:Kappa-type opioid receptor
Type:G Protein-Coupled Receptor (GPCR)
Mol. Mass.:42648.76
Organism:Homo sapiens (Human)
Description:P41145
Residue:380
BDBM50097695
NameBDBM50097695
Synonyms:CHEMBL3590191
TypeSmall organic molecule
Emp. Form.C29H34FN3O3S
Mol. Mass.523.662
SMILESCC(C)N(CCNC(=O)c1ccc2CN(CCc2c1)S(=O)(=O)c1ccc(C)cc1)Cc1ccc(F)cc1