Reaction Details
TargetKappa-type opioid receptor
LigandBDBM50097701
Substrate/Competitorn/a
Meas. Tech.ChEMBL_1504512 (CHEMBL3590954)
IC50 76±n/a nM
Citation Frankowski, KJSlauson, SRLovell, KMPhillips, AMStreicher, JMZhou, LWhipple, DASchoenen, FJPrisinzano, TEBohn, LMAubé, J Potency enhancement of the¿-opioid receptor antagonist probe ML140 through sulfonamide constraint utilizing a tetrahydroisoquinoline motif. Bioorg Med Chem23:3948-56 (2015) 
 
Kappa-type opioid receptor
Name:Kappa-type opioid receptor
Type:G Protein-Coupled Receptor (GPCR)
Mol. Mass.:42648.76
Organism:Homo sapiens (Human)
Description:P41145
Residue:380
BDBM50097701
NameBDBM50097701
Synonyms:CHEMBL3590197
TypeSmall organic molecule
Emp. Form.C30H36FN3O3S
Mol. Mass.537.689
SMILESCc1ccc(cc1)S(=O)(=O)N1CCc2cc(ccc2C1)C(=O)NCCN(Cc1ccc(F)cc1)C(C)(C)C