Reaction Details
TargetKappa-type opioid receptor
LigandBDBM50097702
Substrate/Competitorn/a
Meas. Tech.ChEMBL_1504512 (CHEMBL3590954)
IC50 1200±n/a nM
Citation Frankowski, KJSlauson, SRLovell, KMPhillips, AMStreicher, JMZhou, LWhipple, DASchoenen, FJPrisinzano, TEBohn, LMAubé, J Potency enhancement of the¿-opioid receptor antagonist probe ML140 through sulfonamide constraint utilizing a tetrahydroisoquinoline motif. Bioorg Med Chem23:3948-56 (2015) 
 
Kappa-type opioid receptor
Name:Kappa-type opioid receptor
Type:G Protein-Coupled Receptor (GPCR)
Mol. Mass.:42648.76
Organism:Homo sapiens (Human)
Description:P41145
Residue:380
BDBM50097702
NameBDBM50097702
Synonyms:CHEMBL3590198
TypeSmall organic molecule
Emp. Form.C32H40FN3O3S
Mol. Mass.565.742
SMILESCc1cc(C)c(c(C)c1)S(=O)(=O)N1CCc2cc(ccc2C1)C(=O)NCCN(Cc1ccc(F)cc1)C(C)(C)C