Reaction Details
TargetMu-type opioid receptor
LigandBDBM50097697
Substrate/Competitorn/a
Meas. Tech.ChEMBL_1504518 (CHEMBL3590960)
Ki 8170±n/a nM
Citation Frankowski, KJSlauson, SRLovell, KMPhillips, AMStreicher, JMZhou, LWhipple, DASchoenen, FJPrisinzano, TEBohn, LMAubé, J Potency enhancement of the¿-opioid receptor antagonist probe ML140 through sulfonamide constraint utilizing a tetrahydroisoquinoline motif. Bioorg Med Chem23:3948-56 (2015) 
 
Mu-type opioid receptor
Name:Mu-type opioid receptor
Type:G Protein-Coupled Receptor (GPCR)
Mol. Mass.:44789.51
Organism:Homo sapiens (Human)
Description:P35372
Residue:400
BDBM50097697
NameBDBM50097697
Synonyms:CHEMBL3590193
TypeSmall organic molecule
Emp. Form.C29H34BrN3O3S
Mol. Mass.584.568
SMILESCC(C)N(CCNC(=O)c1ccc2CN(CCc2c1)S(=O)(=O)c1ccc(C)cc1)Cc1ccc(Br)cc1