Reaction Details
TargetD(3) dopamine receptor
LigandBDBM50097839
Substrate/Competitorn/a
Meas. Tech.ChEMBL_1504529 (CHEMBL3591125)
Ki 3.8±n/a nM
Citation Keck, TMBanala, AKSlack, RDBurzynski, CBonifazi, AOkunola-Bakare, OMMoore, MDeschamps, JRRais, RSlusher, BSNewman, AH Using click chemistry toward novel 1,2,3-triazole-linked dopamine D3 receptor ligands. Bioorg Med Chem23:4000-12 (2015) 
 
D(3) dopamine receptor
Name:D(3) dopamine receptor
Type:n/a
Mol. Mass.:44243.43
Organism:Homo sapiens (Human)
Description:n/a
Residue:400
BDBM50097839
NameBDBM50097839
Synonyms:CHEMBL3588917
TypeSmall organic molecule
Emp. Form.C26H27Cl2N5
Mol. Mass.480.432
SMILESClc1cccc(N2CCN(CCCCc3cn(nn3)-c3ccc4ccccc4c3)CC2)c1Cl