Reaction Details
TargetDual specificity protein kinase CLK1
LigandBDBM50097856
Substrate/Competitorn/a
Meas. Tech.ChEMBL_1502245 (CHEMBL3591181)
IC50 2000±n/a nM
Citation Falke, HChaikuad, ABecker, ALoaëc, NLozach, OAbu Jhaisha, SBecker, WJones, PGPreu, LBaumann, KKnapp, SMeijer, LKunick, C 10-iodo-11H-indolo[3,2-c]quinoline-6-carboxylic acids are selective inhibitors of DYRK1A. J Med Chem58:3131-43 (2015) 
 
Dual specificity protein kinase CLK1
Name:Dual specificity protein kinase CLK1
Type:PROTEIN
Mol. Mass.:57124.52
Organism:Mus musculus
Description:ChEMBL_1502245
Residue:483
BDBM50097856
NameBDBM50097856
Synonyms:CHEMBL3589667
TypeSmall organic molecule
Emp. Form.C17H11IN2O3
Mol. Mass.418.1853
SMILESCOc1ccc2c3[nH]c4c(I)cccc4c3c(nc2c1)C(O)=O