Reaction Details
TargetDual specificity protein kinase CLK2
LigandBDBM50097870
Substrate/Competitorn/a
Meas. Tech.ChEMBL_1502246 (CHEMBL3591182)
IC50 180±n/a nM
Citation Falke, HChaikuad, ABecker, ALoaëc, NLozach, OAbu Jhaisha, SBecker, WJones, PGPreu, LBaumann, KKnapp, SMeijer, LKunick, C 10-iodo-11H-indolo[3,2-c]quinoline-6-carboxylic acids are selective inhibitors of DYRK1A. J Med Chem58:3131-43 (2015) 
 
Dual specificity protein kinase CLK2
Name:Dual specificity protein kinase CLK2
Type:PROTEIN
Mol. Mass.:60021.57
Organism:Mus musculus
Description:ChEMBL_1502246
Residue:499
BDBM50097870
NameBDBM50097870
Synonyms:CHEMBL3589664
TypeSmall organic molecule
Emp. Form.C17H11FN2O3
Mol. Mass.310.2792
SMILESCOc1ccc2c3[nH]c4c(F)cccc4c3c(nc2c1)C(O)=O