Reaction Details
TargetDual specificity protein kinase CLK4
LigandBDBM50097867
Substrate/Competitorn/a
Meas. Tech.ChEMBL_1502248 (CHEMBL3591184)
IC50 45±n/a nM
Citation Falke, HChaikuad, ABecker, ALoaëc, NLozach, OAbu Jhaisha, SBecker, WJones, PGPreu, LBaumann, KKnapp, SMeijer, LKunick, C 10-iodo-11H-indolo[3,2-c]quinoline-6-carboxylic acids are selective inhibitors of DYRK1A. J Med Chem58:3131-43 (2015) 
 
Dual specificity protein kinase CLK4
Name:Dual specificity protein kinase CLK4
Type:PROTEIN
Mol. Mass.:57374.39
Organism:Mus musculus
Description:ChEMBL_1502248
Residue:481
BDBM50097867
NameBDBM50097867
Synonyms:CHEMBL3589660
TypeSmall organic molecule
Emp. Form.C16H9ClN2O2
Mol. Mass.296.708
SMILESOC(=O)c1nc2ccccc2c2[nH]c3c(Cl)cccc3c12