Reaction Details
TargetDual specificity protein kinase CLK4
LigandBDBM50097863
Substrate/Competitorn/a
Meas. Tech.ChEMBL_1502248 (CHEMBL3591184)
IC50>10000±n/a nM
Citation Falke, HChaikuad, ABecker, ALoaëc, NLozach, OAbu Jhaisha, SBecker, WJones, PGPreu, LBaumann, KKnapp, SMeijer, LKunick, C 10-iodo-11H-indolo[3,2-c]quinoline-6-carboxylic acids are selective inhibitors of DYRK1A. J Med Chem58:3131-43 (2015) 
 
Dual specificity protein kinase CLK4
Name:Dual specificity protein kinase CLK4
Type:PROTEIN
Mol. Mass.:57374.39
Organism:Mus musculus
Description:ChEMBL_1502248
Residue:481
BDBM50097863
NameBDBM50097863
Synonyms:CHEMBL3589674
TypeSmall organic molecule
Emp. Form.C23H15ClN2O3
Mol. Mass.402.83
SMILESCOc1cccc(c1)-c1ccc2nc(C(O)=O)c3c4cccc(Cl)c4[nH]c3c2c1