Reaction Details
TargetDual specificity tyrosine-phosphorylation-regulated kinase 1B
LigandBDBM50097859
Substrate/Competitorn/a
Meas. Tech.ChEMBL_1502249 (CHEMBL3591328)
IC50>10000±n/a nM
Citation Falke, HChaikuad, ABecker, ALoaëc, NLozach, OAbu Jhaisha, SBecker, WJones, PGPreu, LBaumann, KKnapp, SMeijer, LKunick, C 10-iodo-11H-indolo[3,2-c]quinoline-6-carboxylic acids are selective inhibitors of DYRK1A. J Med Chem58:3131-43 (2015) 
 
Dual specificity tyrosine-phosphorylation-regulated kinase 1B
Name:Dual specificity tyrosine-phosphorylation-regulated kinase 1B
Type:Enzyme
Mol. Mass.:69222.24
Organism:Homo sapiens (Human)
Description:Q9Y463
Residue:629
BDBM50097859
NameBDBM50097859
Synonyms:CHEMBL3589670
TypeSmall organic molecule
Emp. Form.C16H8FIN2O2
Mol. Mass.406.1498
SMILESOC(=O)c1nc2ccc(I)cc2c2[nH]c3c(F)cccc3c12