Reaction Details
TargetDual specificity tyrosine-phosphorylation-regulated kinase 1B
LigandBDBM50097860
Substrate/Competitorn/a
Meas. Tech.ChEMBL_1502249 (CHEMBL3591328)
IC50 4900±n/a nM
Citation Falke, HChaikuad, ABecker, ALoaëc, NLozach, OAbu Jhaisha, SBecker, WJones, PGPreu, LBaumann, KKnapp, SMeijer, LKunick, C 10-iodo-11H-indolo[3,2-c]quinoline-6-carboxylic acids are selective inhibitors of DYRK1A. J Med Chem58:3131-43 (2015) 
 
Dual specificity tyrosine-phosphorylation-regulated kinase 1B
Name:Dual specificity tyrosine-phosphorylation-regulated kinase 1B
Type:Enzyme
Mol. Mass.:69222.24
Organism:Homo sapiens (Human)
Description:Q9Y463
Residue:629
BDBM50097860
NameBDBM50097860
Synonyms:CHEMBL3589671
TypeSmall organic molecule
Emp. Form.C16H8ClIN2O2
Mol. Mass.422.604
SMILESOC(=O)c1nc2ccc(I)cc2c2[nH]c3c(Cl)cccc3c12