Reaction Details
TargetCyclin-dependent kinase 9
LigandBDBM50097867
Substrate/Competitorn/a
Meas. Tech.ChEMBL_1502244 (CHEMBL3591180)
IC50 15000±n/a nM
Citation Falke, HChaikuad, ABecker, ALoaëc, NLozach, OAbu Jhaisha, SBecker, WJones, PGPreu, LBaumann, KKnapp, SMeijer, LKunick, C 10-iodo-11H-indolo[3,2-c]quinoline-6-carboxylic acids are selective inhibitors of DYRK1A. J Med Chem58:3131-43 (2015) 
 
Cyclin-dependent kinase 9
Name:Cyclin-dependent kinase 9
Type:Enzyme Subunit
Mol. Mass.:42789.13
Organism:Homo sapiens (Human)
Description:n/a
Residue:372
BDBM50097867
NameBDBM50097867
Synonyms:CHEMBL3589660
TypeSmall organic molecule
Emp. Form.C16H9ClN2O2
Mol. Mass.296.708
SMILESOC(=O)c1nc2ccccc2c2[nH]c3c(Cl)cccc3c12