Reaction Details
TargetDual specificity protein kinase CLK1
LigandBDBM50097868
Substrate/Competitorn/a
Meas. Tech.ChEMBL_1502245 (CHEMBL3591181)
IC50 32±n/a nM
Citation Falke, HChaikuad, ABecker, ALoaëc, NLozach, OAbu Jhaisha, SBecker, WJones, PGPreu, LBaumann, KKnapp, SMeijer, LKunick, C 10-iodo-11H-indolo[3,2-c]quinoline-6-carboxylic acids are selective inhibitors of DYRK1A. J Med Chem58:3131-43 (2015) 
 
Dual specificity protein kinase CLK1
Name:Dual specificity protein kinase CLK1
Type:PROTEIN
Mol. Mass.:57124.52
Organism:Mus musculus
Description:ChEMBL_1502245
Residue:483
BDBM50097868
NameBDBM50097868
Synonyms:CHEMBL3589661
TypeSmall organic molecule
Emp. Form.C16H9BrN2O2
Mol. Mass.341.159
SMILESOC(=O)c1nc2ccccc2c2[nH]c3c(Br)cccc3c12