Reaction Details
TargetDual specificity tyrosine-phosphorylation-regulated kinase 2
LigandBDBM50097866
Substrate/Competitorn/a
Meas. Tech.ChEMBL_1502250 (CHEMBL3591329)
IC50>10000±n/a nM
Citation Falke, HChaikuad, ABecker, ALoaëc, NLozach, OAbu Jhaisha, SBecker, WJones, PGPreu, LBaumann, KKnapp, SMeijer, LKunick, C 10-iodo-11H-indolo[3,2-c]quinoline-6-carboxylic acids are selective inhibitors of DYRK1A. J Med Chem58:3131-43 (2015) 
 
Dual specificity tyrosine-phosphorylation-regulated kinase 2
Name:Dual specificity tyrosine-phosphorylation-regulated kinase 2
Type:PROTEIN
Mol. Mass.:66690.69
Organism:Homo sapiens (Human)
Description:ChEMBL_1508025
Residue:601
BDBM50097866
NameBDBM50097866
Synonyms:CHEMBL3589775
TypeSmall organic molecule
Emp. Form.C15H8BrN3O2
Mol. Mass.342.147
SMILESOC(=O)c1nc2cccnc2c2[nH]c3c(Br)cccc3c12