Reaction Details
TargetDual specificity tyrosine-phosphorylation-regulated kinase 3
LigandBDBM50097858
Substrate/Competitorn/a
Meas. Tech.ChEMBL_1502251 (CHEMBL3591330)
IC50>10000±n/a nM
Citation Falke, HChaikuad, ABecker, ALoaëc, NLozach, OAbu Jhaisha, SBecker, WJones, PGPreu, LBaumann, KKnapp, SMeijer, LKunick, C 10-iodo-11H-indolo[3,2-c]quinoline-6-carboxylic acids are selective inhibitors of DYRK1A. J Med Chem58:3131-43 (2015) 
 
Dual specificity tyrosine-phosphorylation-regulated kinase 3
Name:Dual specificity tyrosine-phosphorylation-regulated kinase 3
Type:PROTEIN
Mol. Mass.:65747.26
Organism:Homo sapiens (Human)
Description:ChEMBL_1508026
Residue:588
BDBM50097858
NameBDBM50097858
Synonyms:CHEMBL3589669
TypeSmall organic molecule
Emp. Form.C18H13ClN2O3
Mol. Mass.340.76
SMILESCCOc1ccc2c3[nH]c4c(Cl)cccc4c3c(nc2c1)C(O)=O