Reaction Details
TargetDual specificity tyrosine-phosphorylation-regulated kinase 1A
LigandBDBM50097869
Substrate/Competitorn/a
Meas. Tech.ChEMBL_1502253 (CHEMBL3591332)
IC50 500±n/a nM
Citation Falke, HChaikuad, ABecker, ALoaëc, NLozach, OAbu Jhaisha, SBecker, WJones, PGPreu, LBaumann, KKnapp, SMeijer, LKunick, C 10-iodo-11H-indolo[3,2-c]quinoline-6-carboxylic acids are selective inhibitors of DYRK1A. J Med Chem58:3131-43 (2015) 
 
Dual specificity tyrosine-phosphorylation-regulated kinase 1A
Name:Dual specificity tyrosine-phosphorylation-regulated kinase 1A
Type:Enzyme
Mol. Mass.:85616.61
Organism:Homo sapiens (Human)
Description:Q13627
Residue:763
BDBM50097869
NameBDBM50097869
Synonyms:CHEMBL3589662
TypeSmall organic molecule
Emp. Form.C16H9IN2O2
Mol. Mass.388.1593
SMILESOC(=O)c1nc2ccccc2c2[nH]c3c(I)cccc3c12