Reaction Details
TargetCyclin-dependent kinase 2
LigandBDBM50097860
Substrate/Competitorn/a
Meas. Tech.ChEMBL_1502238 (CHEMBL3591174)
IC50>10000±n/a nM
Citation Falke, HChaikuad, ABecker, ALoaëc, NLozach, OAbu Jhaisha, SBecker, WJones, PGPreu, LBaumann, KKnapp, SMeijer, LKunick, C 10-iodo-11H-indolo[3,2-c]quinoline-6-carboxylic acids are selective inhibitors of DYRK1A. J Med Chem58:3131-43 (2015) 
 
Cyclin-dependent kinase 2
Name:Cyclin-dependent kinase 2
Type:Enzyme Subunit
Mol. Mass.:33938.17
Organism:Homo sapiens (Human)
Description:P24941
Residue:298
BDBM50097860
NameBDBM50097860
Synonyms:CHEMBL3589671
TypeSmall organic molecule
Emp. Form.C16H8ClIN2O2
Mol. Mass.422.604
SMILESOC(=O)c1nc2ccc(I)cc2c2[nH]c3c(Cl)cccc3c12