Reaction Details
TargetCyclin-dependent kinase 2
LigandBDBM50097862
Substrate/Competitorn/a
Meas. Tech.ChEMBL_1502238 (CHEMBL3591174)
IC50>10000±n/a nM
Citation Falke, HChaikuad, ABecker, ALoaëc, NLozach, OAbu Jhaisha, SBecker, WJones, PGPreu, LBaumann, KKnapp, SMeijer, LKunick, C 10-iodo-11H-indolo[3,2-c]quinoline-6-carboxylic acids are selective inhibitors of DYRK1A. J Med Chem58:3131-43 (2015) 
 
Cyclin-dependent kinase 2
Name:Cyclin-dependent kinase 2
Type:Enzyme Subunit
Mol. Mass.:33938.17
Organism:Homo sapiens (Human)
Description:P24941
Residue:298
BDBM50097862
NameBDBM50097862
Synonyms:CHEMBL3589673
TypeSmall organic molecule
Emp. Form.C17H11ClN2O3
Mol. Mass.326.734
SMILESCOc1ccc2nc(C(O)=O)c3c4cccc(Cl)c4[nH]c3c2c1