Reaction Details
TargetMitogen-activated protein kinase 1
LigandBDBM50097878
Substrate/Competitorn/a
Meas. Tech.ChEMBL_1502243 (CHEMBL3591179)
IC50>10000±n/a nM
Citation Falke, HChaikuad, ABecker, ALoaëc, NLozach, OAbu Jhaisha, SBecker, WJones, PGPreu, LBaumann, KKnapp, SMeijer, LKunick, C 10-iodo-11H-indolo[3,2-c]quinoline-6-carboxylic acids are selective inhibitors of DYRK1A. J Med Chem58:3131-43 (2015) 
 
Mitogen-activated protein kinase 1
Name:Mitogen-activated protein kinase 1
Type:Ser/Thr Protein Kinase
Mol. Mass.:41392.76
Organism:Homo sapiens (Human)
Description:P28482
Residue:360
BDBM50097878
NameBDBM50097878
Synonyms:CHEMBL3589658
TypeSmall organic molecule
Emp. Form.C17H10N2O4
Mol. Mass.306.2723
SMILESOC(=O)c1ccc2[nH]c3c(c(nc4ccccc34)C(O)=O)c2c1