Reaction Details
TargetN-formyl peptide receptor 2
LigandBDBM50098046
Substrate/Competitorn/a
Meas. Tech.ChEMBL_1502492 (CHEMBL3592314)
IC50 6650±n/a nM
Citation Stepniewski, TMFilipek, S Non-peptide ligand binding to the formyl peptide receptor FPR2--A comparison to peptide ligand binding modes. Bioorg Med Chem23:4072-81 (2015) 
 
N-formyl peptide receptor 2
Name:N-formyl peptide receptor 2
Type:G Protein-Coupled Receptor (GPCR)
Mol. Mass.:38968.35
Organism:Homo sapiens (Human)
Description:P25090
Residue:351
BDBM50098046
NameBDBM50098046
Synonyms:CHEMBL3590215
TypeSmall organic molecule
Emp. Form.C25H27N3O3
Mol. Mass.417.5002
SMILESCCCCOc1ccc(cc1)C(=O)NN1Cc2ccccc2NC1c1ccc(O)cc1