Reaction Details
TargetN-formyl peptide receptor 2
LigandBDBM50098048
Substrate/Competitorn/a
Meas. Tech.ChEMBL_1502490 (CHEMBL3592312)
EC50 4700±n/a nM
Citation Stepniewski, TMFilipek, S Non-peptide ligand binding to the formyl peptide receptor FPR2--A comparison to peptide ligand binding modes. Bioorg Med Chem23:4072-81 (2015) 
 
N-formyl peptide receptor 2
Name:N-formyl peptide receptor 2
Type:G Protein-Coupled Receptor (GPCR)
Mol. Mass.:38968.35
Organism:Homo sapiens (Human)
Description:P25090
Residue:351
BDBM50098048
NameBDBM50098048
Synonyms:CHEMBL1290698
TypeSmall organic molecule
Emp. Form.C18H19N3O4S
Mol. Mass.373.426
SMILESCOc1ccc2[nH]c(SCC(=O)Nc3ccc(OC)c(OC)c3)nc2c1