Reaction Details
TargetN-formyl peptide receptor 2
LigandBDBM50098060
Substrate/Competitorn/a
Meas. Tech.ChEMBL_1502490 (CHEMBL3592312)
EC50 4030±n/a nM
Citation Stepniewski, TMFilipek, S Non-peptide ligand binding to the formyl peptide receptor FPR2--A comparison to peptide ligand binding modes. Bioorg Med Chem23:4072-81 (2015) 
 
N-formyl peptide receptor 2
Name:N-formyl peptide receptor 2
Type:G Protein-Coupled Receptor (GPCR)
Mol. Mass.:38968.35
Organism:Homo sapiens (Human)
Description:P25090
Residue:351
BDBM50098060
NameBDBM50098060
Synonyms:CHEMBL3590209
TypeSmall organic molecule
Emp. Form.C16H14BrN3O2S
Mol. Mass.392.27
SMILESCOc1ccc2[nH]c(SCC(=O)Nc3ccccc3Br)nc2c1