Reaction Details
TargetN-formyl peptide receptor 2
LigandBDBM50098177
Substrate/Competitorn/a
Meas. Tech.ChEMBL_1502490 (CHEMBL3592312)
EC50 40±n/a nM
Citation Stepniewski, TMFilipek, S Non-peptide ligand binding to the formyl peptide receptor FPR2--A comparison to peptide ligand binding modes. Bioorg Med Chem23:4072-81 (2015) 
 
N-formyl peptide receptor 2
Name:N-formyl peptide receptor 2
Type:G Protein-Coupled Receptor (GPCR)
Mol. Mass.:38968.35
Organism:Homo sapiens (Human)
Description:P25090
Residue:351
BDBM50098177
NameBDBM50098177
Synonyms:CHEMBL3588926
TypeSmall organic molecule
Emp. Form.C21H24BrN3O2
Mol. Mass.430.338
SMILESBrc1ccc(NC(=O)N[C@@H](Cc2ccccc2)C(=O)N2CCCCC2)cc1