Reaction Details
TargetN-formyl peptide receptor 2
LigandBDBM50098180
Substrate/Competitorn/a
Meas. Tech.ChEMBL_1502490 (CHEMBL3592312)
EC50 130±n/a nM
Citation Stepniewski, TMFilipek, S Non-peptide ligand binding to the formyl peptide receptor FPR2--A comparison to peptide ligand binding modes. Bioorg Med Chem23:4072-81 (2015) 
 
N-formyl peptide receptor 2
Name:N-formyl peptide receptor 2
Type:G Protein-Coupled Receptor (GPCR)
Mol. Mass.:38968.35
Organism:Homo sapiens (Human)
Description:P25090
Residue:351
BDBM50098180
NameBDBM50098180
Synonyms:CHEMBL3588923
TypeSmall organic molecule
Emp. Form.C26H29BrN4O4
Mol. Mass.541.437
SMILESCCOC(=O)C1CCN(CC1)C(=O)[C@H](Cc1c[nH]c2ccccc12)NC(=O)Nc1ccc(Br)cc1