Reaction Details
TargetN-formyl peptide receptor 2
LigandBDBM50098181
Substrate/Competitorn/a
Meas. Tech.ChEMBL_1502490 (CHEMBL3592312)
EC50 100±n/a nM
Citation Stepniewski, TMFilipek, S Non-peptide ligand binding to the formyl peptide receptor FPR2--A comparison to peptide ligand binding modes. Bioorg Med Chem23:4072-81 (2015) 
 
N-formyl peptide receptor 2
Name:N-formyl peptide receptor 2
Type:G Protein-Coupled Receptor (GPCR)
Mol. Mass.:38968.35
Organism:Homo sapiens (Human)
Description:P25090
Residue:351
BDBM50098181
NameBDBM50098181
Synonyms:CHEMBL1289381
TypeSmall organic molecule
Emp. Form.C16H17BrN2O2
Mol. Mass.349.222
SMILESCOc1ccc(CCNC(=O)Nc2ccc(Br)cc2)cc1