Reaction Details
TargetN-formyl peptide receptor 2
LigandBDBM50098189
Substrate/Competitorn/a
Meas. Tech.ChEMBL_1502489 (CHEMBL3592311)
IC50 50±n/a nM
Citation Stepniewski, TMFilipek, S Non-peptide ligand binding to the formyl peptide receptor FPR2--A comparison to peptide ligand binding modes. Bioorg Med Chem23:4072-81 (2015) 
 
N-formyl peptide receptor 2
Name:N-formyl peptide receptor 2
Type:G Protein-Coupled Receptor (GPCR)
Mol. Mass.:38968.35
Organism:Homo sapiens (Human)
Description:P25090
Residue:351
BDBM50098189
NameBDBM50098189
Synonyms:CHEMBL3588930
TypeSmall organic molecule
Emp. Form.C118H183N19O13
Mol. Mass.2075.8351
(=O)N[C@@H](CCCCN)C(=O)N(CCC(=O)N[C@@H](CCCCN)C(=O)N(CCC(=O)N[C@@H](CCCCN)C(=O)N(CCC(=O)N[C@@H](CCCCN)C(=O)N(CCC(=O)N[C@@H](CCCCN)C(=O)N(CCC(=O)N[C@@H](CCCCN)C(=O)N(CCC(N)=O)[C@@H](C)c1ccccc1)[C@@H](C)c1ccccc1)[C@@H](C)c1ccccc1)[C@@H](C)c1ccccc1)[C@@H](C)c1ccccc1)[C@@H](C)c1ccccc1