Reaction Details
TargetATPase family AAA domain-containing protein 2
LigandBDBM50098302
Substrate/Competitorn/a
Meas. Tech.ChEMBL_1502807 (CHEMBL3591210)
IC50 251±n/a nM
Citation Bamborough, PChung, CWFurze, RCGrandi, PMichon, AMSheppard, RJBarnett, HDiallo, HDixon, DPDouault, CJones, EJKaramshi, BMitchell, DJPrinjha, RKRau, CWatson, RJWerner, TDemont, EH Structure-Based Optimization of Naphthyridones into Potent ATAD2 Bromodomain Inhibitors. J Med Chem58:6151-78 (2015) 
 
ATPase family AAA domain-containing protein 2
Name:ATPase family AAA domain-containing protein 2
Type:PROTEIN
Mol. Mass.:158546.30
Organism:Homo sapiens (Human)
Description:ChEMBL_1500426
Residue:1390
BDBM50098302
NameBDBM50098302
Synonyms:CHEMBL3590384
TypeSmall organic molecule
Emp. Form.C26H33N5O4
Mol. Mass.479.5713
SMILESCOc1cncc(c1)-c1cnc(N[C@@H]2CCNC[C@H]2OCC2CCOCC2)c2[nH]c(=O)c(C)cc12