Reaction Details
TargetATPase family AAA domain-containing protein 2
LigandBDBM50098306
Substrate/Competitorn/a
Meas. Tech.ChEMBL_1502807 (CHEMBL3591210)
IC50 100±n/a nM
Citation Bamborough, PChung, CWFurze, RCGrandi, PMichon, AMSheppard, RJBarnett, HDiallo, HDixon, DPDouault, CJones, EJKaramshi, BMitchell, DJPrinjha, RKRau, CWatson, RJWerner, TDemont, EH Structure-Based Optimization of Naphthyridones into Potent ATAD2 Bromodomain Inhibitors. J Med Chem58:6151-78 (2015) 
 
ATPase family AAA domain-containing protein 2
Name:ATPase family AAA domain-containing protein 2
Type:PROTEIN
Mol. Mass.:158546.30
Organism:Homo sapiens (Human)
Description:ChEMBL_1500426
Residue:1390
BDBM50098306
NameBDBM50098306
Synonyms:CHEMBL3590406
TypeSmall organic molecule
Emp. Form.C28H37N5O4S
Mol. Mass.539.689
SMILESC[C@H]1C[C@@H](CO[C@@H]2CNCC[C@H]2Nc2ncc(-c3cncc(C)c3)c3cc(C)c(=O)[nH]c23)C[C@@H](C)S1(=O)=O