Reaction Details
TargetBromodomain-containing protein 4
LigandBDBM50098308
Substrate/Competitorn/a
Meas. Tech.ChEMBL_1502808 (CHEMBL3591211)
IC50 5012±n/a nM
Citation Bamborough, PChung, CWFurze, RCGrandi, PMichon, AMSheppard, RJBarnett, HDiallo, HDixon, DPDouault, CJones, EJKaramshi, BMitchell, DJPrinjha, RKRau, CWatson, RJWerner, TDemont, EH Structure-Based Optimization of Naphthyridones into Potent ATAD2 Bromodomain Inhibitors. J Med Chem58:6151-78 (2015) 
 
Bromodomain-containing protein 4
Name:Bromodomain-containing protein 4
Type:Protein
Mol. Mass.:152264.84
Organism:Homo sapiens (Human)
Description:O60885
Residue:1362
BDBM50098308
NameBDBM50098308
Synonyms:CHEMBL3590397
TypeSmall organic molecule
Emp. Form.C20H28N4O4S
Mol. Mass.420.526
SMILESCc1cc2ccnc(N[C@H]3CCNC[C@@H]3OCC3CCS(=O)(=O)CC3)c2[nH]c1=O