Reaction Details
TargetProtein polybromo-1
LigandBDBM50098305
Substrate/Competitorn/a
Meas. Tech.ChEMBL_1502839 (CHEMBL3591399)
Kd 2512±n/a nM
Citation Bamborough, PChung, CWFurze, RCGrandi, PMichon, AMSheppard, RJBarnett, HDiallo, HDixon, DPDouault, CJones, EJKaramshi, BMitchell, DJPrinjha, RKRau, CWatson, RJWerner, TDemont, EH Structure-Based Optimization of Naphthyridones into Potent ATAD2 Bromodomain Inhibitors. J Med Chem58:6151-78 (2015) 
 
Protein polybromo-1
Name:Protein polybromo-1
Type:PROTEIN
Mol. Mass.:192953.62
Organism:Homo sapiens (Human)
Description:ChEMBL_104264
Residue:1689
BDBM50098305
NameBDBM50098305
Synonyms:CHEMBL3590405
TypeSmall organic molecule
Emp. Form.C27H34N4O4S
Mol. Mass.510.648
SMILESCc1cncc(c1)-c1ccc(N[C@@H]2CCNC[C@H]2OCC2CCS(=O)(=O)CC2)c2[nH]c(=O)c(C)cc12