Reaction Details
TargetBromodomain-containing protein 3
LigandBDBM50098301
Substrate/Competitorn/a
Meas. Tech.ChEMBL_1502843 (CHEMBL3591403)
IC50<50119±n/a nM
Citation Bamborough, PChung, CWFurze, RCGrandi, PMichon, AMSheppard, RJBarnett, HDiallo, HDixon, DPDouault, CJones, EJKaramshi, BMitchell, DJPrinjha, RKRau, CWatson, RJWerner, TDemont, EH Structure-Based Optimization of Naphthyridones into Potent ATAD2 Bromodomain Inhibitors. J Med Chem58:6151-78 (2015) 
 
Bromodomain-containing protein 3
Name:Bromodomain-containing protein 3
Type:Protein
Mol. Mass.:79571.81
Organism:Homo sapiens (Human)
Description:Q15059
Residue:726
BDBM50098301
NameBDBM50098301
Synonyms:CHEMBL3590383
TypeSmall organic molecule
Emp. Form.C26H33N5O4S
Mol. Mass.511.636
SMILESCc1cncc(c1)-c1cnc(N[C@@H]2CCNC[C@H]2OCC2CCS(=O)(=O)CC2)c2[nH]c(=O)c(C)cc12