Reaction Details
TargetATPase family AAA domain-containing protein 2
LigandBDBM50098314
Substrate/Competitorn/a
Meas. Tech.ChEMBL_1502807 (CHEMBL3591210)
IC50 25119±n/a nM
Citation Bamborough, PChung, CWFurze, RCGrandi, PMichon, AMSheppard, RJBarnett, HDiallo, HDixon, DPDouault, CJones, EJKaramshi, BMitchell, DJPrinjha, RKRau, CWatson, RJWerner, TDemont, EH Structure-Based Optimization of Naphthyridones into Potent ATAD2 Bromodomain Inhibitors. J Med Chem58:6151-78 (2015) 
 
ATPase family AAA domain-containing protein 2
Name:ATPase family AAA domain-containing protein 2
Type:PROTEIN
Mol. Mass.:158546.30
Organism:Homo sapiens (Human)
Description:ChEMBL_1500426
Residue:1390
BDBM50098314
NameBDBM50098314
Synonyms:CHEMBL3590401
TypeSmall organic molecule
Emp. Form.C17H24N4O2
Mol. Mass.316.3981
SMILESCCCO[C@@H]1CNCC[C@H]1Nc1nccc2cc(C)c(=O)[nH]c12