Reaction Details
TargetBromodomain-containing protein 4
LigandBDBM50098304
Substrate/Competitorn/a
Meas. Tech.ChEMBL_1502808 (CHEMBL3591211)
IC50 50119±n/a nM
Citation Bamborough, PChung, CWFurze, RCGrandi, PMichon, AMSheppard, RJBarnett, HDiallo, HDixon, DPDouault, CJones, EJKaramshi, BMitchell, DJPrinjha, RKRau, CWatson, RJWerner, TDemont, EH Structure-Based Optimization of Naphthyridones into Potent ATAD2 Bromodomain Inhibitors. J Med Chem58:6151-78 (2015) 
 
Bromodomain-containing protein 4
Name:Bromodomain-containing protein 4
Type:Protein
Mol. Mass.:152264.84
Organism:Homo sapiens (Human)
Description:O60885
Residue:1362
BDBM50098304
NameBDBM50098304
Synonyms:CHEMBL3590386
TypeSmall organic molecule
Emp. Form.C24H30N6O3
Mol. Mass.450.5334
SMILESCc1cc2c(cnc(N[C@@H]3CCNC[C@H]3OCC3CCOCC3)c2[nH]c1=O)-c1cncnc1