Reaction Details
TargetCarbonic anhydrase 1
LigandBDBM50098353
Substrate/Competitorn/a
Meas. Tech.ChEMBL_1505005 (CHEMBL3595787)
Ki 36±n/a nM
Citation Ibrahim, DALasheen, DSZaky, MYIbrahim, AWVullo, DCeruso, MSupuran, CTAbou El Ella, DA Design and synthesis of benzothiazole-6-sulfonamides acting as highly potent inhibitors of carbonic anhydrase isoforms I, II, IX and XII. Bioorg Med Chem23:4989-99 (2015) 
 
Carbonic anhydrase 1
Name:Carbonic anhydrase 1
Type:Enzyme
Mol. Mass.:28873.37
Organism:Homo sapiens (Human)
Description:P00915
Residue:261
BDBM50098353
NameBDBM50098353
Synonyms:CHEMBL3594419
TypeSmall organic molecule
Emp. Form.C18H18N8O4S6
Mol. Mass.602.777
SMILESNS(=O)(=O)c1ccc2nc(NC(=S)NCCNC(=S)Nc3nc4ccc(cc4s3)S(N)(=O)=O)sc2c1